Date_Onset,Date_Confirmation,Date_Notification,Sex,Age_Group,County_living,Township_living,Village_Living,Village_Living_Code,Enumeration_unit,Enumeration_unit_long,Enumeration_unit_lat,First_level_dissemination_unit,Second_level_dissemination_unit,County_infected,Township_infected,Village_infected,Village_infected_Code,Imported,Country_infected,Number_of_confirmed_cases,Serotype,MOI_County_living_Code,MOI_Township_living_Code,MOI_County_living,MOI_Township_living,MOI_County_infected_Code,MOI_Township_infected_Code,MOI_County_infected,MOI_Township_infected
1998/01/02,,1998/01/07,M,40-44,Pingtung County,Pingtung City,,,A1320-0136-00,120.50588,22.46425,A1320-04-008,A1320-04,,,,,N,,1,,10013,1001301,Pingtung County,Pingtung City,,,,
1998/01/03,,1998/01/14,M,30-34,Pingtung County,Donggang Township,,,A1303-0150-00,120.45364,22.46639,A1303-09-007,A1303-09,,,,,Y,,1,DENV2,10013,1001303,Pingtung County,Donggang Township,,,,
1998/01/13,,1998/02/18,M,55-59,Yilan County,Yilan City,,,A0201-0449-00,121.75143,24.74922,A0201-23-006,A0201-23,,,,,Y,,1,,10002,1000201,Yilan County,Yilan City,,,,
1998/01/15,,1998/01/23,M,35-39,Kaohsiung City,Lingya Dist.,,,A6408-0153-00,120.33814,22.63032,A6408-10-010,A6408-10,,,,,N,,1,,64,6400800,Kaohsiung City,Lingya District,,,,
1998/01/20,,1998/02/04,M,55-59,Yilan County,Wujie Township,,,A0209-0232-00,121.79826,24.68457,A0209-10-005,A0209-10,,,,,N,,1,,10002,1000209,Yilan County,Wujie Township,,,,
1998/01/22,,1998/02/19,M,20-24,Taoyuan City,Luzhu Dist.,,,A0305-0543-00,121.29651,25.04431,A0305-36-002,A0305-36,,,,,Y,,1,,68,6800500,Taoyuan City,Lujhu District,,,,
1998/01/23,,1998/02/02,M,40-44,New Taipei City,Xindian Dist.,,,A6506-0178-00,121.54746,24.98245,A6506-20-001,A6506-20,,,,,N,,1,,65,6500600,New Taipei City,Sindian District,,,,
1998/01/26,,1998/02/19,F,65-69,Taipei City,Beitou Dist.,,,A6312-0203-00,121.50093,25.13930,A6312-14-008,A6312-14,,,,,N,,1,,63,6301200,Taipei City,Beitou District,,,,
1998/02/11,,1998/02/13,F,25-29,Tainan City,South Dist.,,,A6733-0189-00,120.20907,22.97886,A6733-12-007,A6733-12,,,,,Y,,1,,67,6703300,Tainan City,South District,,,,
1998/02/16,,1998/02/24,M,20-24,Kaohsiung City,Nanzi Dist.,,,A6404-0464-00,120.31323,22.72422,A6404-38-002,A6404-38,,,,,Y,,1,,64,6400400,Kaohsiung City,Nanzih District,,,,
1998/02/17,,1998/02/23,F,30-34,Kaohsiung City,Fengshan Dist.,,,A6412-1199-00,120.33998,22.60702,A6412-A3-688,A6412-A3,,,,,N,,1,DENV2,64,6401200,Kaohsiung City,Fongshan District,,,,
1998/02/23,,1998/03/04,M,55-59,New Taipei City,Linkou Dist.,,,A6517-0610-00,121.36248,25.06533,A6517-29-005,A6517-29,,,,,N,,1,,65,6501700,New Taipei City,Linkou District,,,,
1998/03/05,,1998/03/11,M,40-44,Kaohsiung City,Fengshan Dist.,,,A6412-1737-00,120.32672,22.58874,A6412-F0-967,A6412-F0,,,,,N,,1,DENV3,64,6401200,Kaohsiung City,Fongshan District,,,,
1998/03/07,,1998/03/12,M,30-34,New Taipei City,Tamsui Dist.,,,A6510-0596-00,121.45161,25.17228,A6510-32-001,A6510-32,,,,,N,,1,,65,6501000,New Taipei City,Danshuei District,,,,
1998/03/10,,1998/03/24,M,55-59,New Taipei City,Xinzhuang Dist.,,,A6505-1309-00,121.43512,25.01003,A6505-D5-007,A6505-D5,,,,,Y,,1,,65,6500500,New Taipei City,Sinjhuang District,,,,
1998/03/21,2006/11/29,1998/03/27,F,35-39,Taipei City,Neihu Dist.,,,A6310-0064-00,121.55852,25.08855,A6310-10-001,A6310-10,,,,,N,TAIWAN,1,,63,6301000,Taipei City,Neihu District,,,,
1998/03/22,,1998/03/27,M,30-34,Kaohsiung City,Qianzhen Dist.,,,A6409-0569-00,120.31874,22.58656,A6409-61-010,A6409-61,,,,,N,,1,DENV3,64,6400900,Kaohsiung City,Cianjhen Distric,,,,
1998/03/23,,1998/03/27,M,35-39,Kaohsiung City,Qianzhen Dist.,,,A6409-0509-00,120.31139,22.59085,A6409-63-007,A6409-63,,,,,N,,1,DENV3,64,6400900,Kaohsiung City,Cianjhen Distric,,,,
1998/04/02,,1998/04/12,M,30-34,Taipei City,Da'an Dist.,,,A6303-0656-00,121.54558,25.02976,A6303-61-001,A6303-61,,,,,Y,,1,,63,6300300,Taipei City,Da-an District,,,,
1998/04/04,,1998/04/23,F,20-24,Hsinchu County,Hukou Township,,,A0405-0455-00,121.05576,24.87738,A0405-20-014,A0405-20,,,,,Y,,1,,10004,1000405,Hsinchu County,Hukou Township,,,,
1998/04/09,,1998/04/27,M,40-44,Nantou County,Shuili Township,,,A0811-0043-00,120.85035,23.81893,A0811-01-012,A0811-01,,,,,N,,1,,10008,1000811,Nantou County,Shueili Township,,,,
1998/04/11,,1998/04/16,M,30-34,Taichung City,Nantun Dist.,,,A6607-0405-00,120.59822,24.14036,A6607-18-011,A6607-18,,,,,Y,,1,,66,6600700,Taichung City,Nantun District,,,,
1998/04/13,,1998/04/22,M,30-34,Kaohsiung City,Niaosong Dist.,,,A6418-0274-00,120.38550,22.65548,A6418-10-084,A6418-10,,,,,N,,1,,64,6401800,Kaohsiung City,Niaosong District,,,,
1998/04/17,,1998/04/21,F,55-59,Nantou County,Lugu Township,,,A0803-0416-00,120.68461,23.97848,A0803-20-001,A0803-20,,,,,N,,1,,10008,1000807,Nantou County,Lugu Township,,,,
1998/04/21,,1998/04/27,M,55-59,New Taipei City,Xinzhuang Dist.,,,A6505-1052-00,121.41278,25.02344,A6505-A8-009,A6505-A8,,,,,N,,1,,65,6500500,New Taipei City,Sinjhuang District,,,,
1998/04/21,,1998/04/30,M,35-39,Nantou County,Jiji Township,,,A0805-0066-00,120.78699,23.82838,A0805-03-010,A0805-03,,,,,Y,,1,,10008,1000805,Nantou County,Jiji Township,,,,
1998/04/27,,1998/04/28,M,35-39,Nantou County,Nantou City,,,A0801-0162-00,120.69787,23.93966,A0801-09-002,A0801-09,,,,,N,,1,,10008,1000801,Nantou County,Nantou City,,,,
1998/05/11,,1998/05/19,F,20-24,Taoyuan City,Guishan Dist.,,,A0307-0548-00,121.35751,25.00217,A0307-20-021,A0307-20,,,,,N,,1,,68,6800700,Taoyuan City,Gueishan District,,,,
1998/05/13,,1998/05/19,M,35-39,New Taipei City,Tamsui Dist.,,,A6510-0973-00,121.46191,25.13221,A6510-49-004,A6510-49,,,,,N,,1,,65,6501000,New Taipei City,Danshuei District,,,,
1998/05/15,,1998/05/25,M,30-34,New Taipei City,Wugu Dist.,,,A6515-0195-00,121.43660,25.08390,A6515-17-004,A6515-17,,,,,Y,,1,,65,6501500,New Taipei City,Wugu District,,,,
1998/05/18,,1998/05/28,M,30-34,New Taipei City,Yonghe Dist.,,,A6504-0042-00,121.51571,25.01678,A6504-02-006,A6504-02,,,,,N,,1,,65,6500400,New Taipei City,Yonghe District,,,,
1998/05/22,,1998/06/19,F,35-39,Kaohsiung City,Fengshan Dist.,,,A6412-1206-00,120.34034,22.60645,A6412-A3-691,A6412-A3,,,,,N,,1,,64,6401200,Kaohsiung City,Fongshan District,,,,
1998/05/25,,1998/06/05,M,20-24,Taichung City,Fengyuan Dist.,,,A6609-0228-00,120.74243,24.25693,A6609-09-008,A6609-09,,,,,N,,1,,66,6600900,Taichung City,Fongyuan District,,,,
1998/06/01,,1998/06/15,F,30-34,Kaohsiung City,Lingya Dist.,,,A6408-0192-00,120.32659,22.62865,A6408-18-006,A6408-18,,,,,N,,1,,64,6400800,Kaohsiung City,Lingya District,,,,
1998/06/20,,1998/07/13,M,25-29,Kaohsiung City,Yancheng Dist.,,,A6401-0109-00,120.28927,22.62159,A6401-13-002,A6401-13,,,,,N,,1,,64,6400100,Kaohsiung City,Yancheng District,,,,
1998/06/23,,1998/07/03,F,30-34,Kaohsiung City,Qianjin Dist.,,,A6407-0125-00,120.29197,22.62215,A6407-12-008,A6407-12,,,,,N,,1,,64,6400700,Kaohsiung City,Cianjin District,,,,
1998/07/04,,1998/07/22,M,5-9,Pingtung County,Donggang Township,,,A1303-0298-00,120.44663,22.45959,A1303-20-002,A1303-20,,,,,N,,1,,10013,1001303,Pingtung County,Donggang Township,,,,
1998/07/06,,1998/07/16,M,35-39,New Taipei City,Banqiao Dist.,,,A6501-1510-00,121.44341,25.00249,A6501-E9-008,A6501-E9,,,,,Y,,1,,65,6500100,New Taipei City,Banciao District,,,,
1998/07/09,,1998/07/18,F,20-24,Pingtung County,Donggang Township,,,A1303-0364-00,120.47368,22.44526,A1303-22-006,A1303-22,,,,,Y,,1,,10013,1001303,Pingtung County,Donggang Township,,,,
1998/07/09,,1998/07/15,F,20-24,Pingtung County,Donggang Township,,,A1301-0230-00,120.49472,22.68580,A1301-10-009,A1301-10,,,,,Y,,1,,10013,1001303,Pingtung County,Donggang Township,,,,
1998/07/11,,1998/07/22,M,15-19,Hsinchu City,Other,,,A1801-0468-00,120.99932,24.79753,A1801-33-006,A1801-33,,,,,N,,1,DENV2,,,,,,,,
1998/07/15,,1998/07/16,F,60-64,Kaohsiung City,Xinxing Dist.,Daming Vil.,6400600-025,A6406-0158-00,120.30369,22.62990,A6406-17-002,A6406-17,,,,,N,,1,DENV2,64,6400600,Kaohsiung City,Sinsing District,,,,
1998/07/15,,1998/07/28,F,20-24,Yunlin County,Xiluo Township,,,A0904-0016-00,120.44755,23.80782,A0904-01-002,A0904-01,,,,,Y,,1,,10009,1000904,Yunlin County,Siluo Township,,,,
1998/07/17,,1998/07/20,F,5-9,Pingtung County,Donggang Township,,,A1303-0102-00,120.44781,22.46848,A1303-10-001,A1303-10,,,,,Y,,1,,10013,1001303,Pingtung County,Donggang Township,,,,
1998/07/17,,1998/08/10,M,45-49,Taipei City,Xinyi Dist.,,,A6302-0721-00,121.56536,25.02591,A6302-64-002,A6302-64,,,,,N,,1,,63,6300200,Taipei City,Sinyi District,,,,
1998/07/22,,1998/07/28,F,50-54,Kaohsiung City,Fengshan Dist.,,,A6412-1513-00,120.33752,22.59544,A6412-C9-867,A6412-C9,,,,,N,,1,,64,6401200,Kaohsiung City,Fongshan District,,,,
1998/07/25,,1998/07/31,F,45-49,Taoyuan City,Zhongli Dist.,,,A0302-2450-00,121.24208,24.92724,A0302-C8-009,A0302-C8,,,,,N,,1,,68,6800200,Taoyuan City,Jhongli District,,,,
1998/07/26,,1998/07/29,M,45-49,Taoyuan City,Dayuan Dist.,,,A0306-0304-00,121.25874,25.07276,A0306-14-006,A0306-14,,,,,Y,,1,,68,6800600,Taoyuan City,Dayuan District,,,,
1998/07/27,,1998/07/30,M,45-49,Taoyuan City,Guishan Dist.,,,A0307-0076-00,121.36607,25.05729,A0307-04-005,A0307-04,,,,,Y,,1,DENV3,68,6800700,Taoyuan City,Gueishan District,,,,
1998/07/30,,1998/08/04,M,50-54,Taoyuan City,Zhongli Dist.,,,A0302-1388-00,121.26184,24.95993,A0302-66-012,A0302-66,,,,,Y,,1,DENV2,68,6800200,Taoyuan City,Jhongli District,,,,
1998/07/31,,1998/08/14,M,35-39,Kaohsiung City,Sanmin Dist.,,,A6405-1338-00,120.31902,22.63868,A6405-C1-007,A6405-C1,,,,,N,,1,,64,6400500,Kaohsiung City,Sanmin District,,,,
1998/08/02,,1998/08/13,M,10-14,Changhua County,Lukang Township,,,A0702-0046-00,120.46107,24.10551,A0702-02-009,A0702-02,,,,,Y,,1,,10007,1000702,Changhua County,Lugang Township,,,,
1998/08/02,,1998/07/12,M,45-49,Taipei City,Wenshan Dist.,,,A6308-0075-00,121.56695,25.00515,A6308-05-008,A6308-05,,,,,Y,,1,,63,6300800,Taipei City,Wunshan District,,,,
1998/08/07,,1998/08/11,M,35-39,Hsinchu County,Hukou Township,,,A0405-0419-00,121.07080,24.88120,A0405-20-011,A0405-20,,,,,Y,,1,,10004,1000405,Hsinchu County,Hukou Township,,,,
1998/08/07,2006/11/27,1998/08/14,F,25-29,Kaohsiung City,Sanmin Dist.,,,A6405-1338-00,120.31902,22.63868,A6405-C1-007,A6405-C1,Kaohsiung City,Sanmin Dist.,,,N,TAIWAN,1,DENV1,64,6400500,Kaohsiung City,Sanmin District,64,6400500,Kaohsiung City,Sanmin District
1998/08/09,,1998/08/17,F,2,Kaohsiung City,Jiaxian Dist.,,,A6433-0030-00,120.59029,23.08298,A6433-04-017,A6433-04,,,,,Y,,1,DENV1,64,6403300,Kaohsiung City,Jiasian District,,,,
1998/08/10,,1998/08/14,M,45-49,Taipei City,Wanhua Dist.,,,A6307-0252-00,121.49889,25.03553,A6307-16-008,A6307-16,,,,,N,,1,,63,6300700,Taipei City,Wanhua District,,,,
1998/08/11,,1998/08/17,M,40-44,Taipei City,Wenshan Dist.,Xingfu Vil.,6300800-019,A6308-0406-00,121.54555,24.99713,A6308-36-003,A6308-36,,,,,N,,1,DENV3,63,6300800,Taipei City,Wunshan District,,,,
1998/08/11,,1998/08/15,M,25-29,Kaohsiung City,Lingya Dist.,,,A6408-0654-00,120.29378,22.61467,A6408-73-005,A6408-73,,,,,N,,1,DENV4,64,6400800,Kaohsiung City,Lingya District,,,,
1998/08/14,,1998/08/26,M,45-49,Pingtung County,Nanzhou Township,,,A1320-0032-00,120.50365,22.49039,A1320-01-003,A1320-01,,,,,N,,1,,10013,1001320,Pingtung County,Nanjhou Township,,,,
1998/08/21,,1998/08/21,F,35-39,New Taipei City,Sanxia Dist.,,,A6509-0469-00,121.40151,24.91488,A6509-29-001,A6509-29,,,,,N,,1,,65,6500900,New Taipei City,Sansia District,,,,
1998/08/28,,1998/09/05,M,50-54,Tainan City,Annan Dist.,,,A6735-0780-00,120.21778,23.04390,A6735-31-004,A6735-31,,,,,N,,1,DENV1,67,6703500,Tainan City,West Central District,,,,
1998/08/28,,1998/09/04,M,30-34,Hualien County,Xincheng Township,,,A1504-0145-00,121.60255,24.02905,A1504-04-010,A1504-04,,,,,Y,,1,DENV1,10015,1001504,Hualien County,Sincheng Township,,,,
1998/08/30,,1998/09/01,M,30-34,New Taipei City,Sanxia Dist.,,,A6509-0254-00,121.36881,24.93419,A6509-14-011,A6509-14,,,,,Y,,1,,65,6500900,New Taipei City,Sansia District,,,,
1998/08/31,,1998/09/04,M,50-54,New Taipei City,Taishan Dist.,,,A6516-0250-00,121.42955,25.04538,A6516-20-009,A6516-20,,,,,N,,1,DENV3,65,6501600,New Taipei City,Taishan District,,,,
1998/09/02,,1998/09/08,M,20-24,Taoyuan City,Taoyuan Dist.,,,A0301-0818-00,121.31912,25.00374,A0301-53-008,A0301-53,,,,,N,,1,,68,6800100,Taoyuan City,Taoyuan District,,,,
1998/09/03,,1998/09/11,M,40-44,New Taipei City,Yingge Dist.,,,A6508-0251-00,121.35031,24.95378,A6508-17-011,A6508-17,,,,,N,,1,,65,6500800,New Taipei City,Yingge District,,,,
1998/09/05,,1998/09/16,F,30-34,Taipei City,Da'an Dist.,,,A6303-0876-00,121.53454,25.02642,A6303-59-007,A6303-59,,,,,N,,1,,63,6300300,Taipei City,Da-an District,,,,
1998/09/05,,1998/09/14,F,20-24,Nantou County,Zhushan Township,,,A0804-0149-00,120.70343,23.76349,A0804-09-002,A0804-09,,,,,N,,1,DENV1,10008,1000804,Nantou County,Jhushan Township,,,,
1998/09/06,,1998/09/15,M,55-59,Kaohsiung City,Qianjin Dist.,,,A6407-0090-00,120.28981,22.62631,A6407-12-001,A6407-12,,,,,N,,1,,64,6400700,Kaohsiung City,Cianjin District,,,,
1998/09/06,,1998/09/14,F,70+,New Taipei City,Yonghe Dist.,,,A6504-0356-00,121.52141,25.00907,A6504-28-005,A6504-28,,,,,N,,1,,65,6500400,New Taipei City,Yonghe District,,,,
1998/09/06,,1998/09/11,M,35-39,Kaohsiung City,Zuoying Dist.,,,A6402-0336-00,120.29487,22.65536,A6402-27-006,A6402-27,,,,,Y,,1,DENV1,64,6400300,Kaohsiung City,Zuoying District,,,,
1998/09/06,,1998/09/19,M,30-34,Taitung County,Donghe Township,,,A1407-0287-00,121.30337,22.96860,A1407-02-007,A1407-02,,,,,N,,1,,10014,1001407,Taitung County,Donghe Township,,,,
1998/09/06,,1998/09/11,M,35-39,Kaohsiung City,Qianzhen Dist.,,,A6409-0242-00,120.33272,22.60772,A6409-30-005,A6409-30,,,,,N,,1,,64,6400900,Kaohsiung City,Cianjhen Distric,,,,
1998/09/06,,1998/09/28,M,25-29,Taitung County,Taitung City,,,A1401-0165-00,121.12419,22.78055,A1401-06-005,A1401-06,,,,,Y,,1,,10014,1001401,Taitung County,Taitung City,,,,
1998/09/07,,1998/09/30,F,55-59,Kaohsiung City,Qianzhen Dist.,,,A6409-0242-00,120.33272,22.60772,A6409-30-005,A6409-30,,,,,N,,1,,64,6400900,Kaohsiung City,Cianjhen Distric,,,,
1998/09/08,,1998/09/11,M,40-44,New Taipei City,Sanxia Dist.,,,A6503-0143-00,121.47137,25.00539,A6503-13-003,A6503-13,,,,,N,,1,,65,6500900,New Taipei City,Sansia District,,,,
1998/09/08,,1998/09/16,M,35-39,Taipei City,Neihu Dist.,,,A6310-0372-00,121.57427,25.08210,A6310-26-008,A6310-26,,,,,N,,1,,63,6301000,Taipei City,Neihu District,,,,
1998/09/11,,1998/09/21,F,40-44,Changhua County,Changhua City,,,A0701-0082-00,120.55359,24.09636,A0701-03-004,A0701-03,,,,,Y,,1,,10007,1000701,Changhua County,Changhua City,,,,
1998/09/11,,1998/09/16,M,5-9,Taipei City,Da'an Dist.,,,A6303-0138-00,121.53873,25.04143,A6303-11-001,A6303-11,,,,,N,,1,DENV3,63,6300300,Taipei City,Da-an District,,,,
1998/09/11,,1998/09/17,M,50-54,Kaohsiung City,Qianjin Dist.,,,A6407-0090-00,120.28981,22.62631,A6407-12-001,A6407-12,,,,,N,,1,,64,6400700,Kaohsiung City,Cianjin District,,,,
1998/09/11,,1998/09/17,F,45-49,Kaohsiung City,Sanmin Dist.,,,A6405-0085-00,120.32229,22.66829,A6405-07-006,A6405-07,,,,,N,,1,,64,6400500,Kaohsiung City,Sanmin District,,,,
1998/09/12,,1998/09/19,F,70+,Changhua County,Changhua City,,,A0701-0324-00,120.53746,24.08702,A0701-20-003,A0701-20,,,,,N,,1,,10007,1000701,Changhua County,Changhua City,,,,
1998/09/14,,1998/09/19,F,45-49,Nantou County,Zhushan Township,,,A0804-0155-00,120.70172,23.76303,A0804-09-003,A0804-09,,,,,N,,1,,10008,1000804,Nantou County,Jhushan Township,,,,
1998/09/14,,1998/09/18,F,45-49,Taoyuan City,Daxi Dist.,,,A0303-0306-00,121.26589,24.88751,A0303-20-005,A0303-20,,,,,Y,,1,,68,6800300,Taoyuan City,Dasi District,,,,
1998/09/16,,1998/09/22,M,15-19,Taipei City,Shilin Dist.,,,A6311-1151-00,121.51893,25.08353,A6311-86-008,A6311-86,,,,,N,,1,,63,6301100,Taipei City,Shihlin District,,,,
1998/09/16,,1998/09/28,M,20-24,Pingtung County,Neipu Township,,,A1313-0163-00,120.58768,22.66721,A1313-10-006,A1313-10,,,,,N,,1,,10013,1001313,Pingtung County,Neipu Township,,,,
1998/09/18,,1998/10/13,M,40-44,Taipei City,Shilin Dist.,,,A6311-0200-00,121.53363,25.11835,A6311-14-008,A6311-14,,,,,N,,1,,63,6301100,Taipei City,Shihlin District,,,,
1998/09/18,,1998/09/24,F,30-34,Taipei City,Da'an Dist.,,,A6303-0177-00,121.55601,25.04050,A6303-14-004,A6303-14,,,,,N,,1,,63,6300300,Taipei City,Da-an District,,,,
1998/09/21,,1998/09/29,F,60-64,New Taipei City,Sanchong Dist.,,,A6502-1022-00,121.48814,25.06072,A6502-A5-001,A6502-A5,,,,,N,,1,,65,6500200,New Taipei City,Sanchong District,,,,
1998/09/21,,1998/09/29,M,20-24,Changhua County,Puyan Township,,,A0714-0320-00,120.44006,23.97668,A0714-14-005,A0714-14,,,,,Y,,1,,10007,1000714,Changhua County,Puyan Township,,,,
1998/09/21,,1998/09/25,M,50-54,New Taipei City,Wugu Dist.,,,A6515-0341-00,121.45157,25.06750,A6515-19-021,A6515-19,,,,,N,,1,,65,6501500,New Taipei City,Wugu District,,,,
1998/09/22,,1998/09/29,M,25-29,Kaohsiung City,Linyuan Dist.,,,A6413-0064-00,120.40577,22.52469,A6413-08-038,A6413-08,,,,,N,,1,DENV2,64,6401300,Kaohsiung City,Linyuan District,,,,
1998/09/23,,1998/09/28,M,35-39,Kaohsiung City,Sanmin Dist.,,,A6405-0086-00,120.32129,22.66829,A6405-07-005,A6405-07,,,,,N,,1,DENV2,64,6400500,Kaohsiung City,Sanmin District,,,,
1998/09/24,,1998/09/30,F,4,Kaohsiung City,Qianzhen Dist.,,,A6409-0242-00,120.33272,22.60772,A6409-30-005,A6409-30,,,,,N,,1,,64,6400900,Kaohsiung City,Cianjhen Distric,,,,
1998/09/24,,1998/09/28,M,30-34,Kaohsiung City,Qianzhen Dist.,,,A6409-0670-00,120.32576,22.57855,A6409-81-008,A6409-81,,,,,N,,1,,64,6400900,Kaohsiung City,Cianjhen Distric,,,,
1998/09/24,,1998/10/08,F,25-29,Kaohsiung City,Nanzi Dist.,,,A6404-0651-00,120.31511,22.71907,A6404-49-006,A6404-49,,,,,N,,1,,64,6400400,Kaohsiung City,Nanzih District,,,,
1998/09/25,,1998/10/08,M,10-14,Kaohsiung City,Zuoying Dist.,,,A6403-0487-00,120.28191,22.67829,A6403-41-006,A6403-41,,,,,N,,1,,64,6400300,Kaohsiung City,Zuoying District,,,,
1998/09/25,,1998/10/03,M,35-39,Pingtung County,Wandan Township,,,A1305-0105-00,120.46207,22.61173,A1305-04-008,A1305-04,,,,,N,,1,,10013,1001305,Pingtung County,Wandan Township,,,,
1998/09/25,,1998/10/09,M,25-29,Taoyuan City,Guanyin Dist.,,,A0304-0061-00,121.09983,24.95175,A0304-06-002,A0304-06,,,,,N,,1,,68,6801200,Taoyuan City,Guanyin District,,,,
1998/09/26,,1998/10/07,M,65-69,Kaohsiung City,Zuoying Dist.,Chongshi Vil.,6400300-034,A6403-0487-00,120.28191,22.67829,A6403-41-006,A6403-41,,,,,N,,1,DENV1,64,6400300,Kaohsiung City,Zuoying District,,,,
1998/09/26,,1998/10/07,M,65-69,Kaohsiung City,Zuoying Dist.,,,A6403-0475-00,120.27933,22.67809,A6403-06-003,A6403-06,,,,,N,,1,DENV1,64,6400300,Kaohsiung City,Zuoying District,,,,
1998/09/26,,1998/09/29,M,20-24,Kaohsiung City,Sanmin Dist.,,,A6405-0222-00,120.32348,22.66107,A6405-24-003,A6405-24,,,,,N,,1,,64,6400500,Kaohsiung City,Sanmin District,,,,
1998/09/26,,1998/10/08,F,40-44,Kaohsiung City,Sanmin Dist.,,,A6405-0073-00,120.32386,22.66947,A6405-06-008,A6405-06,,,,,N,,1,,64,6400500,Kaohsiung City,Sanmin District,,,,
1998/09/27,,1998/10/08,F,45-49,New Taipei City,Zhonghe Dist.,,,A6503-0975-00,121.50148,24.99477,A6503-89-002,A6503-89,,,,,Y,,1,,65,6500300,New Taipei City,Jhonghe District,,,,
1998/09/28,,1998/10/02,M,35-39,Taichung City,East Dist.,,,A6602-0178-00,120.70541,24.13932,A6602-13-001,A6602-13,,,,,N,,1,DENV3,66,6600200,Taichung City,East District,,,,
1998/09/28,,1998/10/07,M,50-54,Kaohsiung City,Sanmin Dist.,,,A6405-0073-00,120.32386,22.66947,A6405-06-008,A6405-06,,,,,N,,1,,64,6400500,Kaohsiung City,Sanmin District,,,,
1998/09/30,,1998/10/07,M,50-54,New Taipei City,Wugu Dist.,,,A6515-0028-00,121.41363,25.10771,A6515-08-001,A6515-08,,,,,N,,1,,65,6501500,New Taipei City,Wugu District,,,,
1998/10/02,,1998/10/09,F,20-24,New Taipei City,Sanchong Dist.,,,A6502-0582-00,121.49233,25.07044,A6502-60-007,A6502-60,,,,,Y,,1,,65,6500200,New Taipei City,Sanchong District,,,,
1998/10/03,,1998/10/09,M,70+,Taipei City,Beitou Dist.,,,A6312-0479-00,121.50610,25.12938,A6312-35-008,A6312-35,,,,,N,,1,,63,6301200,Taipei City,Beitou District,,,,
1998/10/05,,1998/10/12,M,35-39,Yilan County,Zhuangwei Township,,,A0206-0144-00,121.78485,24.74780,A0206-06-001,A0206-06,,,,,N,,1,,10002,1000206,Yilan County,Jhuangwei Township,,,,
1998/10/05,,1998/10/13,F,20-24,Pingtung County,Neipu Township,,,A1313-0032-00,120.62889,22.69820,A1313-02-004,A1313-02,,,,,N,,1,,10013,1001313,Pingtung County,Neipu Township,,,,
1998/10/06,,1998/10/06,F,30-34,Kaohsiung City,Qianzhen Dist.,,,A6409-0569-00,120.31874,22.58656,A6409-61-010,A6409-61,,,,,N,,1,DENV3,64,6400900,Kaohsiung City,Cianjhen Distric,,,,
1998/10/07,,1998/10/17,F,55-59,Kaohsiung City,Qianzhen Dist.,,,A6409-0306-00,120.33025,22.60577,A6409-40-004,A6409-40,,,,,N,,1,,64,6400900,Kaohsiung City,Cianjhen Distric,,,,
1998/10/09,,1998/10/22,M,70+,Kaohsiung City,Zuoying Dist.,,,A6403-0487-00,120.28191,22.67829,A6403-41-006,A6403-41,,,,,N,,1,,64,6400300,Kaohsiung City,Zuoying District,,,,
1998/10/12,,1998/10/19,F,30-34,New Taipei City,Zhonghe Dist.,,,A6503-1424-00,121.50932,24.98924,A6503-C6-003,A6503-C6,,,,,N,,1,DENV2,65,6500300,New Taipei City,Jhonghe District,,,,
1998/10/13,,1998/10/15,F,20-24,Kaohsiung City,Linyuan Dist.,,,A6413-0003-00,120.39948,22.53512,A6413-02-006,A6413-02,,,,,N,,1,DENV2,64,6401300,Kaohsiung City,Linyuan District,,,,
1998/10/14,,1998/10/14,F,35-39,Taipei City,Beitou Dist.,,,A6312-0545-00,121.53000,25.12673,A6312-38-008,A6312-38,,,,,N,,1,,63,6301200,Taipei City,Beitou District,,,,
1998/10/17,,1998/10/22,F,60-64,Kaohsiung City,Sanmin Dist.,,,A6405-0085-00,120.32229,22.66829,A6405-07-006,A6405-07,,,,,N,,1,DENV2,64,6400500,Kaohsiung City,Sanmin District,,,,
1998/10/18,,1998/11/13,M,40-44,Kaohsiung City,Sanmin Dist.,,,A6405-0104-00,120.32460,22.66726,A6405-12-002,A6405-12,,,,,N,,1,,64,6400500,Kaohsiung City,Sanmin District,,,,
1998/10/19,,1998/10/23,F,45-49,New Taipei City,Luzhou Dist.,,,A6514-0477-00,121.46020,25.08253,A6514-40-012,A6514-40,,,,,N,,1,DENV2,65,6501400,New Taipei City,Lujhou District,,,,
1998/10/19,,1998/10/28,M,30-34,Kaohsiung City,Sanmin Dist.,Dingli Vil.,6400500-004,A6405-0085-00,120.32229,22.66829,A6405-07-006,A6405-07,,,,,N,,1,,64,6400500,Kaohsiung City,Sanmin District,,,,
1998/10/20,,1998/11/02,F,65-69,Taipei City,Wanhua Dist.,,,A6307-0506-00,121.50527,25.02654,A6307-41-001,A6307-41,,,,,N,,1,,63,6300700,Taipei City,Wanhua District,,,,
1998/10/20,,1998/10/31,M,30-34,Taichung City,North Dist.,,,A6605-0409-00,120.67829,24.15778,A6605-33-007,A6605-33,,,,,N,,1,,66,6600500,Taichung City,North District,,,,
1998/10/22,,1998/10/29,F,60-64,Kaohsiung City,Sanmin Dist.,,,A6405-1333-00,120.29112,22.63870,A6405-87-009,A6405-87,,,,,N,,1,DENV2,64,6400500,Kaohsiung City,Sanmin District,,,,
1998/10/22,,1998/10/29,M,65-69,Kaohsiung City,Sanmin Dist.,,,A6405-1333-00,120.29112,22.63870,A6405-87-009,A6405-87,,,,,N,,1,DENV2,64,6400500,Kaohsiung City,Sanmin District,,,,
1998/10/23,,1998/10/31,M,40-44,Tainan City,Qigu Dist.,,,A6715-0105-00,120.14902,23.13960,A6715-03-009,A6715-03,,,,,N,,1,,67,6701500,Tainan City,Cigu District,,,,
1998/10/23,,1998/12/14,F,20-24,Kaohsiung City,Lingya Dist.,,,A6408-0308-00,120.31949,22.62370,A6408-35-006,A6408-35,,,,,N,,1,,64,6400800,Kaohsiung City,Lingya District,,,,
1998/10/24,,1998/11/23,F,40-44,Tainan City,East Dist.,,,A6732-0684-00,120.21367,22.97924,A6732-40-006,A6732-40,,,,,N,,1,,67,6703200,Tainan City,East District,,,,
1998/10/30,,1998/11/11,M,30-34,Taipei City,Wanhua Dist.,,,A6307-0099-00,121.50120,25.04150,A6307-07-004,A6307-07,,,,,N,,1,,63,6300700,Taipei City,Wanhua District,,,,
1998/10/30,,1998/12/02,M,45-49,Tainan City,West Central Dist.,,,A6737-0197-00,120.20390,22.99784,A6737-12-002,A6737-12,,,,,N,,1,,67,6703700,Tainan City,West Central District,,,,
1998/10/31,,1998/11/03,M,60-64,New Taipei City,Wugu Dist.,,,A6515-0067-00,121.41720,25.10237,A6515-08-003,A6515-08,,,,,N,,1,,65,6501500,New Taipei City,Wugu District,,,,
1998/11/01,,1998/11/04,F,40-44,Kaohsiung City,Sanmin Dist.,Dingjin Vil.,6400500-001,A6405-0107-00,120.32314,22.66697,A6405-12-001,A6405-12,,,,,N,,1,,64,6400500,Kaohsiung City,Sanmin District,,,,